bcı source code building error

This forum deals with BCI2000 configuration issues.
Post Reply
ykutlu
Posts: 5
Joined: 28 Jan 2019, 15:49

bcı source code building error

Post by ykutlu » 28 Jan 2019, 16:03

when i was trying build bcı2000 source code zip file visual studio giving me LNK2001, LNK2019, MSB6006, MSB3073, LNK1120, LNK4098 error ı can't find what is wrong because ı made everything just like building page it is giving me error .It is not just that it is also giving me authentication error and when ı try update svn it telling me bcı2000 locked it is not update or download the files.

mellinger
Posts: 1041
Joined: 12 Feb 2003, 11:06

Re: bcı source code building error

Post by mellinger » 06 Feb 2019, 11:00

Maybe the instructions you followed are outdated.
Please follow these instructions:
https://www.bci2000.org/mediawiki/index ... ng_BCI2000

-Jürgen

ykutlu
Posts: 5
Joined: 28 Jan 2019, 15:49

Re: bcı source code building error

Post by ykutlu » 07 Feb 2019, 07:22

ı did every step but it is giving me error. When ı was building it is not compile with visual studio and giving me 29 error.

mellinger
Posts: 1041
Joined: 12 Feb 2003, 11:06

Re: bcı source code building error

Post by mellinger » 07 Feb 2019, 10:53

Are you using VisualStudio 2015 or newer?

ykutlu
Posts: 5
Joined: 28 Jan 2019, 15:49

Re: bcı source code building error

Post by ykutlu » 10 Feb 2019, 12:34

i am using visual studio 2017

mellinger
Posts: 1041
Joined: 12 Feb 2003, 11:06

Re: bcı source code building error

Post by mellinger » 12 Feb 2019, 08:59

What kind of error does it give you?

ykutlu
Posts: 5
Joined: 28 Jan 2019, 15:49

Re: bcı source code building error

Post by ykutlu » 12 Feb 2019, 09:25

It's giving me these error . I closed my defender and don't have antivirus program i looked for solution but it is not change anything if you give me some advise it would be helpful

Error LNK2019 Unresolved external symbol "void * __cdecl operator new [] (unsigned __int64)" (?? _ U @ YAPEAX_K @ Z), "public: void __cdecl Vector <wchar_t, 64> :: resize (unsigned __int64)" (? Resize BundleStub referenced in @? $ Vector @ _W $ 0EA @@@ QEAAX_K @ Z) C: \ BCI2000src \ build \ CMakeFiles \ buildutils \ AppBundler \ BundleStub \ Stub.obj 1
Error LNK2001 Unresolved external symbol "void * __cdecl operator new [] (unsigned __int64)" (?? _ U @ YAPEAX_K @ Z) BundleStub C: \ BCI2000src \ build \ CMakeFiles \ buildutils \ AppBundler \ BundleStub \ ZipFileSystem.obj 1
Error LNK2001 Unresolved external symbol "void * __cdecl operator new [] (unsigned __int64)" (?? _ U @ YAPEAX_K @ Z) BundleStub C: \ BCI2000src \ build \ CMakeFiles \ buildutils \ AppBundler \ BundleStub \ NtHookFs.obj 1
Error LNK2019 Unresolved external symbol "void __cdecl operator delete [] (void *)" (?? _V @ YAXPEAX @ Z), referenced in the "void __cdecl LoadMainExecutable (void)" (? LoadMainExecutable @@ YAXXZ) function BundleStub C: \ BCI2000src \ build \ cmakefiles \ buildutils \ appbund the \ bundlestub \ Stub.obj 1
Error LNK2001 Unresolved external symbol "void __cdecl operator delete [] (void *)" (?? _V @ YAXPEAX @ Z) BundleStub C: \ BCI2000src \ build \ CMakeFiles \ buildutils \ AppBundler \ BundleStub \ ZipFileSystem.obj 1
Error LNK2001 Unresolved external symbol "void __cdecl operator delete [] (void *)" (?? _V @ YAXPEAX @ Z)
The bug excludes LNK1120 2 unresolved BundleStub C: \ BCI2000src \ build \ CMakeFiles \ buildutils \ AppBundler \ BundleStub \ Release \ BundleStub.exe 1
Error MSB6006 Exited with code 1 from "cmd.exe". VersionCheck C: \ Program Files (x86) \ Microsoft Visual Studio \ 2017 \ Community \ Common7 \ IDE \ VC \ VCTargets \ Microsoft.CppCommon.targets 209
Error MSB6006 Exited with code 9009 from "cmd.exe" AppBundler C: \ Program Files (x86) \ Microsoft Visual Studio \ 2017 \ Community \ Common7 \ IDE \ VC \ VCTargets \ Microsoft.CppCommon.targets 209
Warning LNK4098 defaultlib 'LIBCMT' conflicts with the use of other libraries; / NODEFAULTLIB: use the library BCI2000MediaPlayer C: \ BCI2000src \ build \ CMakeFiles \ core \ Tools \ BCI2000MediaPlayer \ LINK 1
Error MSB3073 "SetLocale
"C: \ Program Files (x86) \ cmake-3.8.2-win32-x86 \ bin \ cmake.exe" -E make_directory C: / BCI2000src / build / CMakeFiles / buildutils / AppBundler / Test
if% errorlevel% neq 0 goto: cmEnd
"C: \ Program Files (x86) \ cmake-3.8.2-win32-x86 \ bin \ cmake.exe" -E copy C: /BCI2000src/build/CMakeFiles/buildutils/AppBundler/Test/Release/BundleTest.exe C : / BCI2000src / build / CMakeFiles / buildutils / AppBundler / Test || "C: / Program Files (x86) /cmake-3.8.2-win32-x86/bin/cmake.exe" -E remove C: /BCI2000src/build/CMakeFiles/buildutils/AppBundler/Test/Release/BundleTest.exe && "C: / Program Files (x86) /cmake-3.8.2-win32-x86/bin/cmake.exe" -E touch_nocreate .notexist
if% errorlevel% neq 0 goto: cmEnd
: cmend
endlocal & call: cmErrorLevel% errorlevel% & goto: cmDone
: cmerrorlevel
exit / b% 1
CmdOK to
if% errorlevel% neq 0 goto: VCEnd
setLocale
Release \ BundleTest.exe --create 1048576 C: /BCI2000src/build/CMakeFiles/buildutils/AppBundler/Test/testdata.bin
if% errorlevel% neq 0 goto: cmEnd
.. \ Release \ AppBundler.exe C: / BCI2000src / build / buildutils / BundleTest C: /BCI2000src/build/CMakeFiles/buildutils/AppBundler/Test/Release/BundleTest.exe C: / BCI2000src / build / CMakeFiles / buildutils / AppBundler the /Test/Testdata.bin=Test/Test.b
if% errorlevel% neq 0 goto: cmEnd
.. \ .. \ .. \ .. \ buildutils \ BundleTest --test 10000 - C: /current.app/test/test.bin
if% errorlevel% neq 0 goto: cmEnd
: cmend
endlocal & call: cmErrorLevel% errorlevel% & goto: cmDone
: cmerrorlevel
exit / b% 1
CmdOK to
if% errorlevel% neq 0 goto: VCEnd
: Exits with the code 9009 from the "VCEnd" command. BundleTest C: \ Program Files (x86) \ Microsoft Visual Studio \ 2017 \ Community \ Common7 \ IDE \ VC \ VCTargets
Warning LNK4098 defaultlib 'libcmt.lib' conflicts with the use of other libraries; / NODEFAULTLIB: use the library P3Speller C: \ BCI2000src \ build \ CMakeFiles \ core \ Application \ P3Speller \ MSVCRT.lib (initializers.obj) 1
Warning LNK4098 defaultlib 'libcmt.lib' conflicts with the use of other libraries; / NODEFAULTLIB: use the library StimulusPresentation C: \ BCI2000src \ build \ CMakeFiles \ core \ Application \ StimulusPresentation \ MSVCRT.lib (initializers.obj) 1

ykutlu
Posts: 5
Joined: 28 Jan 2019, 15:49

Re: bcı source code building error

Post by ykutlu » 12 Feb 2019, 09:40

The output of compile BCI2000.sln file like this

1> ------ Compilation started: Project: BundleStub, Configuration: Release x64 ------
2> ------ Compilation started: Project: VersionCheck, Configuration: Release x64 ------
3> ------ Compilation started: Project: icon-puzzlepiece, Configuration: Release x64 ------
4> ------ Compilation started: Project: icon-wrench, Configuration: Release x64 ------
5> ------ Compilation started: Project: icon-signal-screen, Configuration: Release x64 ------
6> ------ Compilation started: Project: icon-question-mark, Configuration: Release x64 ------
7> ------ Compilation started: Project: icon-prompt, Configuration: Release x64 ------
8> ------ Compilation started: Project: icon-presentation-screen, Configuration: Release x64 ------
2> Building Custom Rule C: /BCI2000src/build/CMakeLists.txt
2> CMake does not need to re-run because C: /BCI2000src/build/CMakeFiles/generate.stamp is up-to-date.
2> CMake Error at C: / Program Files (x86) /cmake-3.8.2-win32-x86/share/cmake-3.8/Modules/FindSubversion.cmake:99 (message):
2> Command "C: / Program Files / TortoiseSVN / bin / svn.exe info C: / BCI2000src"
2> failed with output:
2>
2> svn: E155007: 'C: \ BCI2000src' is not a working copy
2>
2> Call Stack (most recent call first):
2> cmake / MakeVersionInfo.cmake: 9 (Subversion_WC_INFO)
2>
2>
2> svn: E155007: 'C: \ BCI2000src' is not a working copy
2> - BUILD_DATE set to 2019-02-12Z
1>Stub.obj : error LNK2019: Çözümlenmemiş dış sembol "void * __cdecl operator new[](unsigned __int64)" (??_U@YAPEAX_K@Z), "public: void __cdecl Vector<wchar_t,64>::resize(unsigned __int64)" (?resize@?$Vector@_W$0EA@@@QEAAX_K@Z) işlevinde başvurdu
1>ZipFileSystem.obj : error LNK2001: Çözümlenmemiş dış sembol "void * __cdecl operator new[](unsigned __int64)" (??_U@YAPEAX_K@Z)
1>NtHookFs.obj : error LNK2001: Çözümlenmemiş dış sembol "void * __cdecl operator new[](unsigned __int64)" (??_U@YAPEAX_K@Z)
1>Stub.obj : error LNK2019: Çözümlenmemiş dış sembol "void __cdecl operator delete[](void *)" (??_V@YAXPEAX@Z), "void __cdecl LoadMainExecutable(void)" (?LoadMainExecutable@@YAXXZ) işlevinde başvurdu
1>ZipFileSystem.obj : error LNK2001: Çözümlenmemiş dış sembol "void __cdecl operator delete[](void *)" (??_V@YAXPEAX@Z)
1>NtHookFs.obj : error LNK2001: Çözümlenmemiş dış sembol "void __cdecl operator delete[](void *)" (??_V@YAXPEAX@Z)
1>C:\BCI2000src\build\CMakeFiles\buildutils\AppBundler\BundleStub\Release\BundleStub.exe : fatal error LNK1120: 2 çözümlenmemiş dışlar
1>"BundleStub.vcxproj" projesini oluşturma tamamlandı -- BAŞARISIZ OLDU.
9>------ Derleme başladı: Proje: icon-gui-screen, Yapılandırma: Release x64 ------
2>C:\Program Files (x86)\Microsoft Visual Studio\2017\Community\Common7\IDE\VC\VCTargets\Microsoft.CppCommon.targets(209,5): error MSB6006: "cmd.exe" öğesinden 1 koduyla çıkıldı.
2>"VersionCheck.vcxproj" projesini oluşturma tamamlandı -- BAŞARISIZ OLDU.
10>------ Derleme başladı: Proje: icon-film, Yapılandırma: Release x64 ------
11>------ Derleme başladı: Proje: icon-exclamation-mark, Yapılandırma: Release x64 ------
12>------ Derleme başladı: Proje: icon-cogwheel-screen, Yapılandırma: Release x64 ------
13>------ Derleme başladı: Proje: AppBundler (Build\Tools\AppBundler\AppBundler), Yapılandırma: Release x64 ------
14>------ Derleme başladı: Proje: OperatorLib, Yapılandırma: Release x64 ------
15>------ Derleme başladı: Proje: BCI2000Automation64, Yapılandırma: Release x64 ------
16>------ Derleme başladı: Proje: BCI2000PresentationLink64, Yapılandırma: Release x64 ------
17>------ Derleme başladı: Proje: BCI2000PythonBindings, Yapılandırma: Release x64 ------
13>Building Custom Rule C:/BCI2000src/build/buildutils/AppBundler/CMakeLists.txt
13>CMake does not need to re-run because C:/BCI2000src/build/CMakeFiles/buildutils/AppBundler/CMakeFiles/generate.stamp is up-to-date.
13>Generating BundleStub.bin
13>'C:\BCI2000src\build\CMakeFiles\buildutils\AppBundler\BundleStub\Release\BundleStub.exe' is not recognized as an internal or external command,
13>operable program or batch file.
13>C:\Program Files (x86)\Microsoft Visual Studio\2017\Community\Common7\IDE\VC\VCTargets\Microsoft.CppCommon.targets(209,5): error MSB6006: "cmd.exe" öğesinden 9009 koduyla çıkıldı.
13>"AppBundler.vcxproj" projesini oluşturma tamamlandı -- BAŞARISIZ OLDU.
18>------ Derleme başladı: Proje: BCI2000RemoteLib, Yapılandırma: Release x64 ------
19>------ Derleme başladı: Proje: BCI2000Shell, Yapılandırma: Release x64 ------
20>------ Derleme başladı: Proje: vAmpSource, Yapılandırma: Release x64 ------
21>------ Derleme başladı: Proje: Micromed, Yapılandırma: Release x64 ------
22>------ Derleme başladı: Proje: ARSignalProcessing, Yapılandırma: Release x64 ------
15> C:/BCI2000src/build/CMakeFiles/contrib/ExternalLinks/BCI2000Automation/Release/BCI2000Automation64.lib kitaplığı ve C:/BCI2000src/build/CMakeFiles/contrib/ExternalLinks/BCI2000Automation/Release/BCI2000Automation64.exp nesnesi oluşturuluyor
18> C:/BCI2000src/build/CMakeFiles/core/Operator/BCI2000Remote/Release/BCI2000RemoteLib.lib kitaplığı ve C:/BCI2000src/build/CMakeFiles/core/Operator/BCI2000Remote/Release/BCI2000RemoteLib.exp nesnesi oluşturuluyor
14> C:/BCI2000src/build/CMakeFiles/core/Operator/OperatorLib/Release/OperatorLib.lib kitaplığı ve C:/BCI2000src/build/CMakeFiles/core/Operator/OperatorLib/Release/OperatorLib.exp nesnesi oluşturuluyor
16> C:/BCI2000src/build/CMakeFiles/contrib/ExternalLinks/BCI2000PresentationLink/Release/BCI2000PresentationLink64.lib kitaplığı ve C:/BCI2000src/build/CMakeFiles/contrib/ExternalLinks/BCI2000PresentationLink/Release/BCI2000PresentationLink64.exp nesnesi oluşturuluyor
18>BCI2000RemoteLib.vcxproj -> C:\BCI2000src\build\CMakeFiles\core\Operator\BCI2000Remote\Release\BCI2000RemoteLib.dll
16>BCI2000PresentationLink64.vcxproj -> C:\BCI2000src\build\CMakeFiles\contrib\ExternalLinks\BCI2000PresentationLink\Release\BCI2000PresentationLink64.dll
15>BCI2000Automation64.vcxproj -> C:\BCI2000src\build\CMakeFiles\contrib\ExternalLinks\BCI2000Automation\Release\BCI2000Automation64.dll
14>OperatorLib.vcxproj -> C:\BCI2000src\build\CMakeFiles\core\Operator\OperatorLib\Release\OperatorLib.dll
21>Micromed.vcxproj -> C:\BCI2000src\build\CMakeFiles\contrib\SignalSource\Micromed\Release\Micromed.exe
20>vAmpSource.vcxproj -> C:\BCI2000src\build\CMakeFiles\contrib\SignalSource\vAmp\Release\vAmpSource.exe
22>ARSignalProcessing.vcxproj -> C:\BCI2000src\build\CMakeFiles\core\SignalProcessing\AR\Release\ARSignalProcessing.exe
19>BCI2000Shell.vcxproj -> C:\BCI2000src\build\CMakeFiles\core\Operator\BCI2000Shell\Release\BCI2000Shell.exe
14> Copy to destination
15> Copy to destination
21> Create application bundle
16> Copy to destination
18> Copy to destination
19> Copy to destination
21>creating bundle:
23>------ Derleme başladı: Proje: AmpServerPro, Yapılandırma: Release x64 ------
20> Create application bundle
24>------ Derleme başladı: Proje: BAlertSource, Yapılandırma: Release x64 ------
22> Create application bundle
20>creating bundle:
25>------ Derleme başladı: Proje: BCI2000CertAnalysis, Yapılandırma: Release x64 ------
26>------ Derleme başladı: Proje: BCI2000CertificationTester, Yapılandırma: Release x64 ------
27>------ Derleme başladı: Proje: BCI2000Command, Yapılandırma: Release x64 ------
22>creating bundle:
21>'"C:\BCI2000src\build\buildutils\AppBundler"' is not recognized as an internal or external command,
21>operable program or batch file.
21>Error creating bundle.
28>------ Derleme başladı: Proje: BCI2000Export, Yapılandırma: Release x64 ------
23>AmpServerPro.vcxproj -> C:\BCI2000src\build\CMakeFiles\contrib\SignalSource\AmpServerPro\Release\AmpServerPro.exe
23> Create application bundle
22>'"C:\BCI2000src\build\buildutils\AppBundler"' is not recognized as an internal or external command,
22>operable program or batch file.
22>Error creating bundle.
29>------ Derleme başladı: Proje: BCI2000FileInfo, Yapılandırma: Release x64 ------
23>creating bundle:
24>BAlertSource.vcxproj -> C:\BCI2000src\build\CMakeFiles\contrib\SignalSource\B-Alert\Release\BAlertSource.exe
24> Create application bundle
27>BCI2000Command.vcxproj -> C:\BCI2000src\build\CMakeFiles\contrib\ExternalLinks\BCI2000Command\Release\BCI2000Command.exe
27> Create application bundle
24>creating bundle:
27>creating bundle:
26>BCI2000CertificationTester.vcxproj -> C:\BCI2000src\build\CMakeFiles\core\Tools\BCI2000Certification\BCI2000CertificationTester\Release\BCI2000CertificationTester.exe
26> Create application bundle
20>'"C:\BCI2000src\build\buildutils\AppBundler"' is not recognized as an internal or external command,
20>operable program or batch file.
20>Error creating bundle.
27>'"C:\BCI2000src\build\buildutils\AppBundler"' is not recognized as an internal or external command,
27>operable program or batch file.
27>Error creating bundle.
30>------ Derleme başladı: Proje: BCI2000Launcher, Yapılandırma: Release x64 ------
28>BCI2000Export.vcxproj -> C:\BCI2000src\build\CMakeFiles\core\Tools\BCI2000ExportQt\Release\BCI2000Export.exe
28> Create application bundle
23>'"C:\BCI2000src\build\buildutils\AppBundler"' is not recognized as an internal or external command,
23>operable program or batch file.
23>Error creating bundle.
31>------ Derleme başladı: Proje: BCI2000MediaPlayer, Yapılandırma: Release x64 ------
32>------ Derleme başladı: Proje: BCI2000Viewer, Yapılandırma: Release x64 ------
28>creating bundle:
24>'"C:\BCI2000src\build\buildutils\AppBundler"' is not recognized as an internal or external command,
24>operable program or batch file.
24>Error creating bundle.
25>BCI2000CertAnalysis.vcxproj -> C:\BCI2000src\build\CMakeFiles\core\Tools\BCI2000Certification\BCI2000CertificationAnalysis\Release\BCI2000CertAnalysis.exe
25> Create application bundle
33>------ Derleme başladı: Proje: BioRadio, Yapılandırma: Release x64 ------
25>creating bundle:
31>LINK : warning LNK4098: defaultlib 'LIBCMT' diğer kitaplıkların kullanımı ile çakışıyor; /NODEFAULTLIB:library kullanın
28>'"C:\BCI2000src\build\buildutils\AppBundler"' is not recognized as an internal or external command,
28>operable program or batch file.
32>BCI2000Viewer.vcxproj -> C:\BCI2000src\build\CMakeFiles\core\Tools\BCI2000ViewerQt\Release\BCI2000Viewer.exe
28>Error creating bundle.
34>------ Derleme başladı: Proje: Biosemi2, Yapılandırma: Release x64 ------
32> Create application bundle
33>BioRadio.vcxproj -> C:\BCI2000src\build\CMakeFiles\contrib\SignalSource\BioRadio\Release\BioRadio.exe
33> Create application bundle
32>creating bundle:
33>creating bundle:
25>'"C:\BCI2000src\build\buildutils\AppBundler"' is not recognized as an internal or external command,
25>operable program or batch file.
25>Error creating bundle.
35>------ Derleme başladı: Proje: Blackrock, Yapılandırma: Release x64 ------
31>BCI2000MediaPlayer.vcxproj -> C:\BCI2000src\build\CMakeFiles\core\Tools\BCI2000MediaPlayer\Release\BCI2000MediaPlayer.exe
31> Create application bundle
31>creating bundle:
26>creating bundle:
34>Biosemi2.vcxproj -> C:\BCI2000src\build\CMakeFiles\contrib\SignalSource\Biosemi\Release\Biosemi2.exe
34> Create application bundle
34>creating bundle:
33>'"C:\BCI2000src\build\buildutils\AppBundler"' is not recognized as an internal or external command,
33>operable program or batch file.
33>Error creating bundle.
36>------ Derleme başladı: Proje: BundleTest, Yapılandırma: Release x64 ------
35>Blackrock.vcxproj -> C:\BCI2000src\build\CMakeFiles\contrib\SignalSource\Blackrock\Release\Blackrock.exe
36>BundleTest.vcxproj -> C:\BCI2000src\build\CMakeFiles\buildutils\AppBundler\Test\Release\BundleTest.exe
36>Copy to destination
35> Create application bundle
32>'"C:\BCI2000src\build\buildutils\AppBundler"' is not recognized as an internal or external command,
32>operable program or batch file.
36>Creating test file "C:/BCI2000src/build/CMakeFiles/buildutils/AppBundler/Test/testdata.bin" of size 1048576 ... done.
36>'..\Release\AppBundler.exe' is not recognized as an internal or external command,
36>operable program or batch file.
36>C:\Program Files (x86)\Microsoft Visual Studio\2017\Community\Common7\IDE\VC\VCTargets\Microsoft.CppCommon.targets(138,5): error MSB3073: "setlocal
36>C:\Program Files (x86)\Microsoft Visual Studio\2017\Community\Common7\IDE\VC\VCTargets\Microsoft.CppCommon.targets(138,5): error MSB3073: "C:\Program Files (x86)\cmake-3.8.2-win32-x86\bin\cmake.exe" -E make_directory C:/BCI2000src/build/CMakeFiles/buildutils/AppBundler/Test
36>C:\Program Files (x86)\Microsoft Visual Studio\2017\Community\Common7\IDE\VC\VCTargets\Microsoft.CppCommon.targets(138,5): error MSB3073: if %errorlevel% neq 0 goto :cmEnd
36>C:\Program Files (x86)\Microsoft Visual Studio\2017\Community\Common7\IDE\VC\VCTargets\Microsoft.CppCommon.targets(138,5): error MSB3073: "C:\Program Files (x86)\cmake-3.8.2-win32-x86\bin\cmake.exe" -E copy C:/BCI2000src/build/CMakeFiles/buildutils/AppBundler/Test/Release/BundleTest.exe C:/BCI2000src/build/CMakeFiles/buildutils/AppBundler/Test || "C:/Program Files (x86)/cmake-3.8.2-win32-x86/bin/cmake.exe" -E remove C:/BCI2000src/build/CMakeFiles/buildutils/AppBundler/Test/Release/BundleTest.exe && "C:/Program Files (x86)/cmake-3.8.2-win32-x86/bin/cmake.exe" -E touch_nocreate .notexist
36>C:\Program Files (x86)\Microsoft Visual Studio\2017\Community\Common7\IDE\VC\VCTargets\Microsoft.CppCommon.targets(138,5): error MSB3073: if %errorlevel% neq 0 goto :cmEnd
36>C:\Program Files (x86)\Microsoft Visual Studio\2017\Community\Common7\IDE\VC\VCTargets\Microsoft.CppCommon.targets(138,5): error MSB3073: :cmEnd
36>C:\Program Files (x86)\Microsoft Visual Studio\2017\Community\Common7\IDE\VC\VCTargets\Microsoft.CppCommon.targets(138,5): error MSB3073: endlocal & call :cmErrorLevel %errorlevel% & goto :cmDone
36>C:\Program Files (x86)\Microsoft Visual Studio\2017\Community\Common7\IDE\VC\VCTargets\Microsoft.CppCommon.targets(138,5): error MSB3073: :cmErrorLevel
36>C:\Program Files (x86)\Microsoft Visual Studio\2017\Community\Common7\IDE\VC\VCTargets\Microsoft.CppCommon.targets(138,5): error MSB3073: exit /b %1
36>C:\Program Files (x86)\Microsoft Visual Studio\2017\Community\Common7\IDE\VC\VCTargets\Microsoft.CppCommon.targets(138,5): error MSB3073: :cmDone
36>C:\Program Files (x86)\Microsoft Visual Studio\2017\Community\Common7\IDE\VC\VCTargets\Microsoft.CppCommon.targets(138,5): error MSB3073: if %errorlevel% neq 0 goto :VCEnd
36>C:\Program Files (x86)\Microsoft Visual Studio\2017\Community\Common7\IDE\VC\VCTargets\Microsoft.CppCommon.targets(138,5): error MSB3073: setlocal
36>C:\Program Files (x86)\Microsoft Visual Studio\2017\Community\Common7\IDE\VC\VCTargets\Microsoft.CppCommon.targets(138,5): error MSB3073: Release\BundleTest.exe --create 1048576 C:/BCI2000src/build/CMakeFiles/buildutils/AppBundler/Test/testdata.bin
36>C:\Program Files (x86)\Microsoft Visual Studio\2017\Community\Common7\IDE\VC\VCTargets\Microsoft.CppCommon.targets(138,5): error MSB3073: if %errorlevel% neq 0 goto :cmEnd
36>C:\Program Files (x86)\Microsoft Visual Studio\2017\Community\Common7\IDE\VC\VCTargets\Microsoft.CppCommon.targets(138,5): error MSB3073: ..\Release\AppBundler.exe C:/BCI2000src/build/buildutils/BundleTest C:/BCI2000src/build/CMakeFiles/buildutils/AppBundler/Test/Release/BundleTest.exe C:/BCI2000src/build/CMakeFiles/buildutils/AppBundler/Test/testdata.bin=test/test.bin
36>C:\Program Files (x86)\Microsoft Visual Studio\2017\Community\Common7\IDE\VC\VCTargets\Microsoft.CppCommon.targets(138,5): error MSB3073: if %errorlevel% neq 0 goto :cmEnd
36>C:\Program Files (x86)\Microsoft Visual Studio\2017\Community\Common7\IDE\VC\VCTargets\Microsoft.CppCommon.targets(138,5): error MSB3073: ..\..\..\..\buildutils\BundleTest --test 10000 - C:/current.app/test/test.bin
36>C:\Program Files (x86)\Microsoft Visual Studio\2017\Community\Common7\IDE\VC\VCTargets\Microsoft.CppCommon.targets(138,5): error MSB3073: if %errorlevel% neq 0 goto :cmEnd
36>C:\Program Files (x86)\Microsoft Visual Studio\2017\Community\Common7\IDE\VC\VCTargets\Microsoft.CppCommon.targets(138,5): error MSB3073: :cmEnd
36>C:\Program Files (x86)\Microsoft Visual Studio\2017\Community\Common7\IDE\VC\VCTargets\Microsoft.CppCommon.targets(138,5): error MSB3073: endlocal & call :cmErrorLevel %errorlevel% & goto :cmDone
36>C:\Program Files (x86)\Microsoft Visual Studio\2017\Community\Common7\IDE\VC\VCTargets\Microsoft.CppCommon.targets(138,5): error MSB3073: :cmErrorLevel
36>C:\Program Files (x86)\Microsoft Visual Studio\2017\Community\Common7\IDE\VC\VCTargets\Microsoft.CppCommon.targets(138,5): error MSB3073: exit /b %1
36>C:\Program Files (x86)\Microsoft Visual Studio\2017\Community\Common7\IDE\VC\VCTargets\Microsoft.CppCommon.targets(138,5): error MSB3073: :cmDone
36>C:\Program Files (x86)\Microsoft Visual Studio\2017\Community\Common7\IDE\VC\VCTargets\Microsoft.CppCommon.targets(138,5): error MSB3073: if %errorlevel% neq 0 goto :VCEnd
36>C:\Program Files (x86)\Microsoft Visual Studio\2017\Community\Common7\IDE\VC\VCTargets\Microsoft.CppCommon.targets(138,5): error MSB3073: :VCEnd" komutundan 9009 koduyla çıkıldı.
36>"BundleTest.vcxproj" projesini oluşturma tamamlandı -- BAŞARISIZ OLDU.
32>Error creating bundle.
37>------ Derleme başladı: Proje: CoherenceFFTSignalProcessing, Yapılandırma: Release x64 ------
38>------ Derleme başladı: Proje: CoherenceSignalProcessing, Yapılandırma: Release x64 ------
35>creating bundle:
34>'"C:\BCI2000src\build\buildutils\AppBundler"' is not recognized as an internal or external command,
34>operable program or batch file.
34>Error creating bundle.
39>------ Derleme başladı: Proje: CursorTask, Yapılandırma: Release x64 ------
26>'"C:\BCI2000src\build\buildutils\AppBundler"' is not recognized as an internal or external command,
26>operable program or batch file.
26>Error creating bundle.
40>------ Derleme başladı: Proje: DASSource, Yapılandırma: Release x64 ------
31>'"C:\BCI2000src\build\buildutils\AppBundler"' is not recognized as an internal or external command,
31>operable program or batch file.
31>Error creating bundle.
31>"BCI2000MediaPlayer.vcxproj" projesini oluşturma tamamlandı.
41>------ Derleme başladı: Proje: DSISerial, Yapılandırma: Release x64 ------
35>'"C:\BCI2000src\build\buildutils\AppBundler"' is not recognized as an internal or external command,
35>operable program or batch file.
35>Error creating bundle.
42>------ Derleme başladı: Proje: DummyApplication, Yapılandırma: Release x64 ------
38>CoherenceSignalProcessing.vcxproj -> C:\BCI2000src\build\CMakeFiles\contrib\SignalProcessing\Coherence\Release\CoherenceSignalProcessing.exe
37>CoherenceFFTSignalProcessing.vcxproj -> C:\BCI2000src\build\CMakeFiles\contrib\SignalProcessing\CoherenceFFT\Release\CoherenceFFTSignalProcessing.exe
38> Create application bundle
37> Create application bundle
38>creating bundle:
37>creating bundle:
40>DASSource.vcxproj -> C:\BCI2000src\build\CMakeFiles\contrib\SignalSource\DASSource\Release\DASSource.exe
40> Create application bundle
41>DSISerial.vcxproj -> C:\BCI2000src\build\CMakeFiles\contrib\SignalSource\DSISerial\Release\DSISerial.exe
40>creating bundle:
41> Create application bundle
41>creating bundle:
42>DummyApplication.vcxproj -> C:\BCI2000src\build\CMakeFiles\core\Application\Dummy\Release\DummyApplication.exe
42> Create application bundle
39>CursorTask.vcxproj -> C:\BCI2000src\build\CMakeFiles\core\Application\CursorTask\Release\CursorTask.exe
39> Create application bundle
37>'"C:\BCI2000src\build\buildutils\AppBundler"' is not recognized as an internal or external command,
37>operable program or batch file.
38>'"C:\BCI2000src\build\buildutils\AppBundler"' is not recognized as an internal or external command,
38>operable program or batch file.
37>Error creating bundle.
38>Error creating bundle.
42>creating bundle:
43>------ Derleme başladı: Proje: DummySignalProcessing, Yapılandırma: Release x64 ------
44>------ Derleme başladı: Proje: Emotiv, Yapılandırma: Release x64 ------
40>'"C:\BCI2000src\build\buildutils\AppBundler"' is not recognized as an internal or external command,
40>operable program or batch file.
40>Error creating bundle.
45>------ Derleme başladı: Proje: FFTSignalProcessing, Yapılandırma: Release x64 ------
41>'"C:\BCI2000src\build\buildutils\AppBundler"' is not recognized as an internal or external command,
41>operable program or batch file.
41>Error creating bundle.
29>BCI2000FileInfo.vcxproj -> C:\BCI2000src\build\CMakeFiles\core\Tools\BCI2000FileInfoQt\Release\BCI2000FileInfo.exe
46>------ Derleme başladı: Proje: FIRProcessing, Yapılandırma: Release x64 ------
43>DummySignalProcessing.vcxproj -> C:\BCI2000src\build\CMakeFiles\core\SignalProcessing\Dummy\Release\DummySignalProcessing.exe
44>Emotiv.vcxproj -> C:\BCI2000src\build\CMakeFiles\contrib\SignalSource\Emotiv\Release\Emotiv.exe
43> Create application bundle
44> Create application bundle
43>creating bundle:
44>creating bundle:
45>FFTSignalProcessing.vcxproj -> C:\BCI2000src\build\CMakeFiles\core\SignalProcessing\FFT\Release\FFTSignalProcessing.exe
45> Create application bundle
39>creating bundle:
45>creating bundle:
46>FIRProcessing.vcxproj -> C:\BCI2000src\build\CMakeFiles\contrib\SignalProcessing\FIR\Release\FIRProcessing.exe
46> Create application bundle
42>'"C:\BCI2000src\build\buildutils\AppBundler"' is not recognized as an internal or external command,
42>operable program or batch file.
42>Error creating bundle.
47>------ Derleme başladı: Proje: FeedbackDemo, Yapılandırma: Release x64 ------
46>creating bundle:
43>'"C:\BCI2000src\build\buildutils\AppBundler"' is not recognized as an internal or external command,
43>operable program or batch file.
43>Error creating bundle.
44>'"C:\BCI2000src\build\buildutils\AppBundler"' is not recognized as an internal or external command,
44>operable program or batch file.
44>Error creating bundle.
48>------ Derleme başladı: Proje: FilePlayback, Yapılandırma: Release x64 ------
29> Create application bundle
45>'"C:\BCI2000src\build\buildutils\AppBundler"' is not recognized as an internal or external command,
45>operable program or batch file.
45>Error creating bundle.
49>------ Derleme başladı: Proje: Grapevine, Yapılandırma: Release x64 ------
29>creating bundle:
50>------ Derleme başladı: Proje: HilbertSignalProcessing, Yapılandırma: Release x64 ------
46>'"C:\BCI2000src\build\buildutils\AppBundler"' is not recognized as an internal or external command,
46>operable program or batch file.
46>Error creating bundle.
51>------ Derleme başladı: Proje: LSLSource, Yapılandırma: Release x64 ------
47>FeedbackDemo.vcxproj -> C:\BCI2000src\build\CMakeFiles\core\Application\FeedbackDemo\Release\FeedbackDemo.exe
47> Create application bundle
47>creating bundle:
48>FilePlayback.vcxproj -> C:\BCI2000src\build\CMakeFiles\contrib\SignalSource\FilePlayback\Release\FilePlayback.exe
48> Create application bundle
49>Grapevine.vcxproj -> C:\BCI2000src\build\CMakeFiles\contrib\SignalSource\Ripple\Release\Grapevine.exe
48>creating bundle:
49> Create application bundle
39>'"C:\BCI2000src\build\buildutils\AppBundler"' is not recognized as an internal or external command,
39>operable program or batch file.
39>Error creating bundle.
52>------ Derleme başladı: Proje: LiveAmpSource, Yapılandırma: Release x64 ------
29>'"C:\BCI2000src\build\buildutils\AppBundler"' is not recognized as an internal or external command,
29>operable program or batch file.
29>Error creating bundle.
49>creating bundle:
50>HilbertSignalProcessing.vcxproj -> C:\BCI2000src\build\CMakeFiles\contrib\SignalProcessing\HilbertSignalProcessing\Release\HilbertSignalProcessing.exe
50> Create application bundle
53>------ Derleme başladı: Proje: MatlabSignalProcessing, Yapılandırma: Release x64 ------
50>creating bundle:
51>LSLSource.vcxproj -> C:\BCI2000src\build\CMakeFiles\contrib\SignalSource\LSLSource\Release\LSLSource.exe
51> Create application bundle
51>creating bundle:
47>'"C:\BCI2000src\build\buildutils\AppBundler"' is not recognized as an internal or external command,
48>'"C:\BCI2000src\build\buildutils\AppBundler"' is not recognized as an internal or external command,
48>operable program or batch file.
48>Error creating bundle.
47>operable program or batch file.
47>Error creating bundle.
54>------ Derleme başladı: Proje: MessageBox, Yapılandırma: Release x64 ------
49>'"C:\BCI2000src\build\buildutils\AppBundler"' is not recognized as an internal or external command,
49>operable program or batch file.
49>Error creating bundle.
55>------ Derleme başladı: Proje: gUSBampSource, Yapılandırma: Release x64 ------
50>'"C:\BCI2000src\build\buildutils\AppBundler"' is not recognized as an internal or external command,
50>operable program or batch file.
50>Error creating bundle.
56>------ Derleme başladı: Proje: ModularEEG, Yapılandırma: Release x64 ------
57>------ Derleme başladı: Proje: NIDAQ_mx_Source, Yapılandırma: Release x64 ------
52>LiveAmpSource.vcxproj -> C:\BCI2000src\build\CMakeFiles\contrib\SignalSource\LiveAmp\Release\LiveAmpSource.exe
52> Create application bundle
52>creating bundle:
53>MatlabSignalProcessing.vcxproj -> C:\BCI2000src\build\CMakeFiles\core\SignalProcessing\Matlab\Release\MatlabSignalProcessing.exe
53> Create application bundle
30>BCI2000Launcher.vcxproj -> C:\BCI2000src\build\CMakeFiles\core\Tools\BCI2000LauncherQt\Release\BCI2000Launcher.exe
51>'"C:\BCI2000src\build\buildutils\AppBundler"' is not recognized as an internal or external command,
51>operable program or batch file.
51>Error creating bundle.
58>------ Derleme başladı: Proje: NeuroSky, Yapılandırma: Release x64 ------
30> Create application bundle
53>creating bundle:
30>creating bundle:
55>gUSBampSource.vcxproj -> C:\BCI2000src\build\CMakeFiles\core\SignalSource\g.USBamp\Release\gUSBampSource.exe
55> Create application bundle
52>'"C:\BCI2000src\build\buildutils\AppBundler"' is not recognized as an internal or external command,
52>operable program or batch file.
55>creating bundle:
52>Error creating bundle.
56>ModularEEG.vcxproj -> C:\BCI2000src\build\CMakeFiles\contrib\SignalSource\ModularEEG\Release\ModularEEG.exe
59>------ Derleme başladı: Proje: NeuroscanAccess, Yapılandırma: Release x64 ------
56> Create application bundle
57>NIDAQ_mx_Source.vcxproj -> C:\BCI2000src\build\CMakeFiles\contrib\SignalSource\NIDAQ-MX\Release\NIDAQ_mx_Source.exe
57> Create application bundle
56>creating bundle:
57>creating bundle:
53>'"C:\BCI2000src\build\buildutils\AppBundler"' is not recognized as an internal or external command,
53>operable program or batch file.
53>Error creating bundle.
58>NeuroSky.vcxproj -> C:\BCI2000src\build\CMakeFiles\contrib\SignalSource\NeuroSky\Release\NeuroSky.exe
60>------ Derleme başladı: Proje: NeuroscanClient, Yapılandırma: Release x64 ------
58> Create application bundle
58>creating bundle:
55>'"C:\BCI2000src\build\buildutils\AppBundler"' is not recognized as an internal or external command,
59>NeuroscanAccess.vcxproj -> C:\BCI2000src\build\CMakeFiles\contrib\SignalSource\NeuroscanAccessSDK\Release\NeuroscanAccess.exe
55>operable program or batch file.
55>Error creating bundle.
59> Create application bundle
56>'"C:\BCI2000src\build\buildutils\AppBundler"' is not recognized as an internal or external command,
56>operable program or batch file.
56>Error creating bundle.
57>'"C:\BCI2000src\build\buildutils\AppBundler"' is not recognized as an internal or external command,
57>operable program or batch file.
57>Error creating bundle.
61>------ Derleme başladı: Proje: OpenBCISource, Yapılandırma: Release x64 ------
30>'"C:\BCI2000src\build\buildutils\AppBundler"' is not recognized as an internal or external command,
30>operable program or batch file.
30>Error creating bundle.
58>'"C:\BCI2000src\build\buildutils\AppBundler"' is not recognized as an internal or external command,
58>operable program or batch file.
58>Error creating bundle.
62>------ Derleme başladı: Proje: Operator (Core\Operator\Operator), Yapılandırma: Release x64 ------
63>------ Derleme başladı: Proje: P300Classifier, Yapılandırma: Release x64 ------
64>------ Derleme başladı: Proje: P3SignalProcessing, Yapılandırma: Release x64 ------
54>MessageBox.vcxproj -> C:\BCI2000src\build\CMakeFiles\core\Operator\MessageBox\Release\MessageBox.exe
54> Copy to destination
65>------ Derleme başladı: Proje: P3Speller, Yapılandırma: Release x64 ------
66>------ Derleme başladı: Proje: PeakDetectSignalProcessing, Yapılandırma: Release x64 ------
59>creating bundle:
59>'"C:\BCI2000src\build\buildutils\AppBundler"' is not recognized as an internal or external command,
59>operable program or batch file.
59>Error creating bundle.
60>NeuroscanClient.vcxproj -> C:\BCI2000src\build\CMakeFiles\contrib\SignalSource\Neuroscan\Release\NeuroscanClient.exe
60> Create application bundle
60>creating bundle:
67>------ Derleme başladı: Proje: PyffApplication, Yapılandırma: Release x64 ------
61>OpenBCISource.vcxproj -> C:\BCI2000src\build\CMakeFiles\contrib\SignalSource\OpenBCISource\Release\OpenBCISource.exe
61> Create application bundle
60>'"C:\BCI2000src\build\buildutils\AppBundler"' is not recognized as an internal or external command,
60>operable program or batch file.
60>Error creating bundle.
68>------ Derleme başladı: Proje: PythonApplication, Yapılandırma: Release x64 ------
65>MSVCRT.lib(initializers.obj) : warning LNK4098: defaultlib 'libcmt.lib' diğer kitaplıkların kullanımı ile çakışıyor; /NODEFAULTLIB:library kullanın
61>creating bundle:
64>P3SignalProcessing.vcxproj -> C:\BCI2000src\build\CMakeFiles\core\SignalProcessing\P3\Release\P3SignalProcessing.exe
64> Create application bundle
63>P300Classifier.vcxproj -> C:\BCI2000src\build\CMakeFiles\core\Tools\P300Classifier\Release\P300Classifier.exe
63> Create application bundle
64>creating bundle:
66>PeakDetectSignalProcessing.vcxproj -> C:\BCI2000src\build\CMakeFiles\contrib\SignalProcessing\PeakDetector\Release\PeakDetectSignalProcessing.exe
67>PyffApplication.vcxproj -> C:\BCI2000src\build\CMakeFiles\contrib\ExternalLinks\PyffApplication\Release\PyffApplication.exe
63>creating bundle:
66> Create application bundle
67> Create application bundle
66>creating bundle:
67>creating bundle:
65>P3Speller.vcxproj -> C:\BCI2000src\build\CMakeFiles\core\Application\P3Speller\Release\P3Speller.exe
65> Create application bundle
61>'"C:\BCI2000src\build\buildutils\AppBundler"' is not recognized as an internal or external command,
61>operable program or batch file.
61>Error creating bundle.
68>PythonApplication.vcxproj -> C:\BCI2000src\build\CMakeFiles\contrib\BCPy2000\foundation\Application\Release\PythonApplication.exe
69>------ Derleme başladı: Proje: PythonSignalProcessing, Yapılandırma: Release x64 ------
68> Create application bundle
64>'"C:\BCI2000src\build\buildutils\AppBundler"' is not recognized as an internal or external command,
64>operable program or batch file.
64>Error creating bundle.
70>------ Derleme başladı: Proje: PythonSource, Yapılandırma: Release x64 ------
68>creating bundle:
66>'"C:\BCI2000src\build\buildutils\AppBundler"' is not recognized as an internal or external command,
66>operable program or batch file.
66>Error creating bundle.
71>------ Derleme başladı: Proje: RDAClient, Yapılandırma: Release x64 ------
69>PythonSignalProcessing.vcxproj -> C:\BCI2000src\build\CMakeFiles\contrib\BCPy2000\foundation\SignalProcessing\Release\PythonSignalProcessing.exe
67>'"C:\BCI2000src\build\buildutils\AppBundler"' is not recognized as an internal or external command,
67>operable program or batch file.
69> Create application bundle
67>Error creating bundle.
72>------ Derleme başladı: Proje: RDAgetparams, Yapılandırma: Release x64 ------
63>'"C:\BCI2000src\build\buildutils\AppBundler"' is not recognized as an internal or external command,
63>operable program or batch file.
63>Error creating bundle.
73>------ Derleme başladı: Proje: SWSignalProcessing, Yapılandırma: Release x64 ------
69>creating bundle:
70>PythonSource.vcxproj -> C:\BCI2000src\build\CMakeFiles\contrib\BCPy2000\foundation\SignalSource\Release\PythonSource.exe
70> Create application bundle
70>creating bundle:
71>RDAClient.vcxproj -> C:\BCI2000src\build\CMakeFiles\contrib\SignalSource\RDAClient\Release\RDAClient.exe
71> Create application bundle
71>creating bundle:
68>'"C:\BCI2000src\build\buildutils\AppBundler"' is not recognized as an internal or external command,
68>operable program or batch file.
68>Error creating bundle.
74>------ Derleme başladı: Proje: SignalGenerator, Yapılandırma: Release x64 ------
65>creating bundle:
72>RDAgetparams.vcxproj -> C:\BCI2000src\build\CMakeFiles\contrib\SignalSource\RDAClient\getparams\Release\RDAgetparams.exe
72> Create application bundle
69>'"C:\BCI2000src\build\buildutils\AppBundler"' is not recognized as an internal or external command,
69>operable program or batch file.
69>Error creating bundle.
72>creating bundle:
70>'"C:\BCI2000src\build\buildutils\AppBundler"' is not recognized as an internal or external command,
70>operable program or batch file.
70>Error creating bundle.
75>------ Derleme başladı: Proje: SoundcardSource, Yapılandırma: Release x64 ------
76>------ Derleme başladı: Proje: SpectralSignalProcessing, Yapılandırma: Release x64 ------
72>'"C:\BCI2000src\build\buildutils\AppBundler"' is not recognized as an internal or external command,
72>operable program or batch file.
72>Error creating bundle.
71>'"C:\BCI2000src\build\buildutils\AppBundler"' is not recognized as an internal or external command,
71>operable program or batch file.
71>Error creating bundle.
73>SWSignalProcessing.vcxproj -> C:\BCI2000src\build\CMakeFiles\contrib\SignalProcessing\SW\Release\SWSignalProcessing.exe
73> Create application bundle
77>------ Derleme başladı: Proje: StatisticsSignalProcessing1, Yapılandırma: Release x64 ------
78>------ Derleme başladı: Proje: StatisticsSignalProcessing2, Yapılandırma: Release x64 ------
73>creating bundle:
74>SignalGenerator.vcxproj -> C:\BCI2000src\build\CMakeFiles\core\SignalSource\SignalGenerator\Release\SignalGenerator.exe
74> Create application bundle
62>Operator.vcxproj -> C:\BCI2000src\build\CMakeFiles\core\Operator\OperatorQt\Release\Operator.exe
75>SoundcardSource.vcxproj -> C:\BCI2000src\build\CMakeFiles\core\SignalSource\SoundcardSource\Release\SoundcardSource.exe
75> Create application bundle
76>SpectralSignalProcessing.vcxproj -> C:\BCI2000src\build\CMakeFiles\core\SignalProcessing\Spectral\Release\SpectralSignalProcessing.exe
73>'"C:\BCI2000src\build\buildutils\AppBundler"' is not recognized as an internal or external command,
73>operable program or batch file.
76> Create application bundle
74>creating bundle:
73>Error creating bundle.
75>creating bundle:
79>------ Derleme başladı: Proje: StatisticsSignalProcessing4, Yapılandırma: Release x64 ------
76>creating bundle:
77>StatisticsSignalProcessing1.vcxproj -> C:\BCI2000src\build\CMakeFiles\contrib\SignalProcessing\Statistics\Release\StatisticsSignalProcessing1.exe
78>StatisticsSignalProcessing2.vcxproj -> C:\BCI2000src\build\CMakeFiles\contrib\SignalProcessing\Statistics\Release\StatisticsSignalProcessing2.exe
77> Create application bundle
78> Create application bundle
77>creating bundle:
78>creating bundle:
65>'"C:\BCI2000src\build\buildutils\AppBundler"' is not recognized as an internal or external command,
65>operable program or batch file.
65>Error creating bundle.
78>Dosya başka bir işlem tarafından kullanıldığından bu işlem dosyaya erişemiyor.
78>The system cannot find the file C:\BCI2000src\build\CMakeFiles\contrib\SignalProcessing\Statistics\Release\.depends.
78>'"C:\BCI2000src\build\buildutils\AppBundler"' is not recognized as an internal or external command,
78>operable program or batch file.
78>Error creating bundle.
65>"P3Speller.vcxproj" projesini oluşturma tamamlandı.
80>------ Derleme başladı: Proje: StimulusPresentation, Yapılandırma: Release x64 ------
81>------ Derleme başladı: Proje: TDTSampleRate, Yapılandırma: Release x64 ------
74>'"C:\BCI2000src\build\buildutils\AppBundler"' is not recognized as an internal or external command,
74>operable program or batch file.
74>Error creating bundle.
76>'"C:\BCI2000src\build\buildutils\AppBundler"' is not recognized as an internal or external command,
76>operable program or batch file.
76>Error creating bundle.
75>'"C:\BCI2000src\build\buildutils\AppBundler"' is not recognized as an internal or external command,
75>operable program or batch file.
75>Error creating bundle.
82>------ Derleme başladı: Proje: TMSi, Yapılandırma: Release x64 ------
83>------ Derleme başladı: Proje: TuckerDavis, Yapılandırma: Release x64 ------
79>StatisticsSignalProcessing4.vcxproj -> C:\BCI2000src\build\CMakeFiles\contrib\SignalProcessing\Statistics\Release\StatisticsSignalProcessing4.exe
79> Create application bundle
79>creating bundle:
79>Dosya başka bir işlem tarafından kullanıldığından bu işlem dosyaya erişemiyor.
79>The system cannot find the file C:\BCI2000src\build\CMakeFiles\contrib\SignalProcessing\Statistics\Release\.depends.
79>'"C:\BCI2000src\build\buildutils\AppBundler"' is not recognized as an internal or external command,
79>operable program or batch file.
79>Error creating bundle.
84>------ Derleme başladı: Proje: actiCHampSource, Yapılandırma: Release x64 ------
77>'"C:\BCI2000src\build\buildutils\AppBundler"' is not recognized as an internal or external command,
77>operable program or batch file.
77>Error creating bundle.
85>------ Derleme başladı: Proje: bci_dat2stream, Yapılandırma: Release x64 ------
86>------ Derleme başladı: Proje: bci_decimate, Yapılandırma: Release x64 ------
62> Create application bundle
62>creating bundle:
81>TDTSampleRate.vcxproj -> C:\BCI2000src\build\CMakeFiles\contrib\SignalSource\TuckerDavis\TDTSampleRate\Release\TDTSampleRate.exe
81>Create application bundle
81>creating bundle:
80>MSVCRT.lib(initializers.obj) : warning LNK4098: defaultlib 'libcmt.lib' diğer kitaplıkların kullanımı ile çakışıyor; /NODEFAULTLIB:library kullanın
80>StimulusPresentation.vcxproj -> C:\BCI2000src\build\CMakeFiles\core\Application\StimulusPresentation\Release\StimulusPresentation.exe
80> Create application bundle
83>TuckerDavis.vcxproj -> C:\BCI2000src\build\CMakeFiles\contrib\SignalSource\TuckerDavis\Release\TuckerDavis.exe
82>TMSi.vcxproj -> C:\BCI2000src\build\CMakeFiles\contrib\SignalSource\TMSi\Release\TMSi.exe
82> Create application bundle
83> Create application bundle
82>creating bundle:
83>creating bundle:
84>actiCHampSource.vcxproj -> C:\BCI2000src\build\CMakeFiles\contrib\SignalSource\actiCHamp\Release\actiCHampSource.exe
81>'"C:\BCI2000src\build\buildutils\AppBundler"' is not recognized as an internal or external command,
84> Create application bundle
81>operable program or batch file.
81>Error creating bundle.
87>------ Derleme başladı: Proje: bci_prm2stream, Yapılandırma: Release x64 ------
85>bci_dat2stream.vcxproj -> C:\BCI2000src\build\CMakeFiles\core\Tools\cmdline\Release\bci_dat2stream.exe
85> Create application bundle
84>creating bundle:
62>'"C:\BCI2000src\build\buildutils\AppBundler"' is not recognized as an internal or external command,
62>operable program or batch file.
86>bci_decimate.vcxproj -> C:\BCI2000src\build\CMakeFiles\core\Tools\cmdline\Release\bci_decimate.exe
62>Error creating bundle.
86> Create application bundle
88>------ Derleme başladı: Proje: bci_stream2asc, Yapılandırma: Release x64 ------
85>creating bundle:
86>creating bundle:
86>Dosya başka bir işlem tarafından kullanıldığından bu işlem dosyaya erişemiyor.
86>The system cannot find the file C:\BCI2000src\build\CMakeFiles\core\Tools\cmdline\Release\.depends.
86>'"C:\BCI2000src\build\buildutils\AppBundler"' is not recognized as an internal or external command,
86>operable program or batch file.
86>Error creating bundle.
89>------ Derleme başladı: Proje: bci_stream2mat, Yapılandırma: Release x64 ------
85>'"C:\BCI2000src\build\buildutils\AppBundler"' is not recognized as an internal or external command,
85>operable program or batch file.
85>Error creating bundle.
90>------ Derleme başladı: Proje: bci_stream2prm, Yapılandırma: Release x64 ------
82>'"C:\BCI2000src\build\buildutils\AppBundler"' is not recognized as an internal or external command,
82>operable program or batch file.
82>Error creating bundle.
91>------ Derleme başladı: Proje: bci_stream2table, Yapılandırma: Release x64 ------
83>'"C:\BCI2000src\build\buildutils\AppBundler"' is not recognized as an internal or external command,
83>operable program or batch file.
83>Error creating bundle.
92>------ Derleme başladı: Proje: gHIampSource, Yapılandırma: Release x64 ------
87>bci_prm2stream.vcxproj -> C:\BCI2000src\build\CMakeFiles\core\Tools\cmdline\Release\bci_prm2stream.exe
87> Create application bundle
84>'"C:\BCI2000src\build\buildutils\AppBundler"' is not recognized as an internal or external command,
84>operable program or batch file.
84>Error creating bundle.
93>------ Derleme başladı: Proje: gMOBIlab, Yapılandırma: Release x64 ------
87>creating bundle:
88>bci_stream2asc.vcxproj -> C:\BCI2000src\build\CMakeFiles\core\Tools\cmdline\Release\bci_stream2asc.exe
88> Create application bundle
89>bci_stream2mat.vcxproj -> C:\BCI2000src\build\CMakeFiles\core\Tools\cmdline\Release\bci_stream2mat.exe
89> Create application bundle
88>creating bundle:
88>Dosya başka bir işlem tarafından kullanıldığından bu işlem dosyaya erişemiyor.
88>The system cannot find the file C:\BCI2000src\build\CMakeFiles\core\Tools\cmdline\Release\.depends.
88>'"C:\BCI2000src\build\buildutils\AppBundler"' is not recognized as an internal or external command,
88>operable program or batch file.
88>Error creating bundle.
89>creating bundle:
89>Dosya başka bir işlem tarafından kullanıldığından bu işlem dosyaya erişemiyor.
89>The system cannot find the file C:\BCI2000src\build\CMakeFiles\core\Tools\cmdline\Release\.depends.
89>'"C:\BCI2000src\build\buildutils\AppBundler"' is not recognized as an internal or external command,
89>operable program or batch file.
89>Error creating bundle.
94>------ Derleme başladı: Proje: gMOBIlabPlus, Yapılandırma: Release x64 ------
87>'"C:\BCI2000src\build\buildutils\AppBundler"' is not recognized as an internal or external command,
87>operable program or batch file.
87>Error creating bundle.
90>bci_stream2prm.vcxproj -> C:\BCI2000src\build\CMakeFiles\core\Tools\cmdline\Release\bci_stream2prm.exe
90> Create application bundle
95>------ Derleme başladı: Proje: gNautilusSource, Yapılandırma: Release x64 ------
90>creating bundle:
91>bci_stream2table.vcxproj -> C:\BCI2000src\build\CMakeFiles\core\Tools\cmdline\Release\bci_stream2table.exe
91> Create application bundle
96>------ Derleme başladı: Proje: gUSBampgetinfo, Yapılandırma: Release x64 ------
92>gHIampSource.vcxproj -> C:\BCI2000src\build\CMakeFiles\core\SignalSource\g.HIampSource\Release\gHIampSource.exe
92> Create application bundle
91>creating bundle:
91>Dosya başka bir işlem tarafından kullanıldığından bu işlem dosyaya erişemiyor.
91>The system cannot find the file C:\BCI2000src\build\CMakeFiles\core\Tools\cmdline\Release\.depends.
91>'"C:\BCI2000src\build\buildutils\AppBundler"' is not recognized as an internal or external command,
91>operable program or batch file.
91>Error creating bundle.
97>------ Derleme başladı: Proje: gUnicornADC, Yapılandırma: Release x64 ------
92>creating bundle:
90>'"C:\BCI2000src\build\buildutils\AppBundler"' is not recognized as an internal or external command,
90>operable program or batch file.
90>Error creating bundle.
93>gMOBIlab.vcxproj -> C:\BCI2000src\build\CMakeFiles\core\SignalSource\g.MOBIlab\Release\gMOBIlab.exe
93> Create application bundle
93>creating bundle:
80>creating bundle:
96>gUSBampgetinfo.vcxproj -> C:\BCI2000src\build\CMakeFiles\core\SignalSource\g.USBamp\getinfo\Release\gUSBampgetinfo.exe
96> Create application bundle
92>'"C:\BCI2000src\build\buildutils\AppBundler"' is not recognized as an internal or external command,
92>operable program or batch file.
92>Error creating bundle.
96>creating bundle:
94>gMOBIlabPlus.vcxproj -> C:\BCI2000src\build\CMakeFiles\core\SignalSource\g.MOBIlabPlus\Release\gMOBIlabPlus.exe
95>gNautilusSource.vcxproj -> C:\BCI2000src\build\CMakeFiles\core\SignalSource\g.NautilusSource\Release\gNautilusSource.exe
94> Create application bundle
95> Create application bundle
94>creating bundle:
95>creating bundle:
93>'"C:\BCI2000src\build\buildutils\AppBundler"' is not recognized as an internal or external command,
93>operable program or batch file.
97>gUnicornADC.vcxproj -> C:\BCI2000src\build\CMakeFiles\core\SignalSource\g.Unicorn\Release\gUnicornADC.exe
93>Error creating bundle.
97> Create application bundle
96>'"C:\BCI2000src\build\buildutils\AppBundler"' is not recognized as an internal or external command,
96>operable program or batch file.
96>Error creating bundle.
97>creating bundle:
94>'"C:\BCI2000src\build\buildutils\AppBundler"' is not recognized as an internal or external command,
94>operable program or batch file.
94>Error creating bundle.
95>'"C:\BCI2000src\build\buildutils\AppBundler"' is not recognized as an internal or external command,
95>operable program or batch file.
97>'"C:\BCI2000src\build\buildutils\AppBundler"' is not recognized as an internal or external command,
97>operable program or batch file.
95>Error creating bundle.
97>Error creating bundle.
80>'"C:\BCI2000src\build\buildutils\AppBundler"' is not recognized as an internal or external command,
80>operable program or batch file.
80>Error creating bundle.
80> The project "StimulusPresentation.vcxproj" has been completed.
98> ------ Skipped Compilation Process: Project: ALL_BUILD, Configuration: Release x64 ------
98> No project selected to create this solution configuration
========== Create: 93 successful, 4 failed, 23 updated, 1 skipped ==========

mellinger
Posts: 1041
Joined: 12 Feb 2003, 11:06

Re: bcı source code building error

Post by mellinger » 13 Feb 2019, 09:27

I still don't understand why you are getting these errors, but as a workaround you might disable "USE_APPLICATION_BUNDLES" in CMake.
Let me know whether this fixes the problem for you.

Post Reply

Who is online

Users browsing this forum: No registered users and 1 guest